Reaction Details
TargetOxysterols receptor LXR-alpha
LigandBDBM50204075
Substrate/Competitorn/a
Meas. Tech.ChEMBL_1626049 (CHEMBL3868518)
EC50 69±n/a nM
Citation Kick, EKBusch, BBMartin, RStevens, WCBollu, VXie, YBoren, BCNyman, MCNanao, MHNguyen, LPlonowski, ASchulman, IGYan, GZhang, HHou, XValente, MNNarayanan, RBehnia, KRodrigues, ADBrock, BSmalley, JCantor, GHLupisella, JSleph, PGrimm, DOstrowski, JWexler, RRKirchgessner, TMohan, R Discovery of Highly Potent Liver X Receptorß Agonists. ACS Med Chem Lett7:1207-1212 (2016) 
 
Oxysterols receptor LXR-alpha
Name:Oxysterols receptor LXR-alpha
Type:Enzyme Catalytic Domain
Mol. Mass.:50403.85
Organism:Homo sapiens (Human)
Description:Q13133
Residue:447
BDBM50204075
NameBDBM50204075
Synonyms:CHEMBL3980683
TypeSmall organic molecule
Emp. Form.C27H25Cl2FN2O4S
Mol. Mass.563.468
SMILESCC(C)(O)c1cn(c(Cc2c(Cl)cccc2Cl)n1)-c1ccc(cc1)-c1cc(F)c(CO)c(c1)S(C)(=O)=O