Reaction Details
TargetOxysterols receptor LXR-beta
LigandBDBM50034775
Substrate/Competitorn/a
Meas. Tech.ChEMBL_1626090 (CHEMBL3868559)
EC50 1100±n/a nM
Citation Kick, EKBusch, BBMartin, RStevens, WCBollu, VXie, YBoren, BCNyman, MCNanao, MHNguyen, LPlonowski, ASchulman, IGYan, GZhang, HHou, XValente, MNNarayanan, RBehnia, KRodrigues, ADBrock, BSmalley, JCantor, GHLupisella, JSleph, PGrimm, DOstrowski, JWexler, RRKirchgessner, TMohan, R Discovery of Highly Potent Liver X Receptorß Agonists. ACS Med Chem Lett7:1207-1212 (2016) 
 
Oxysterols receptor LXR-beta
Name:Oxysterols receptor LXR-beta
Type:Enzyme Catalytic Domain
Mol. Mass.:50978.79
Organism:Homo sapiens (Human)
Description:P55055
Residue:460
BDBM50034775
NameBDBM50034775
Synonyms:CHEMBL3360975 US10945978, Compound 38
TypeSmall organic molecule
Emp. Form.C28H29ClN2O3S
Mol. Mass.509.059
SMILESCC(C)(O)c1cn(c(n1)C(C)(C)c1ccccc1Cl)-c1ccc(cc1)-c1cccc(c1)S(C)(=O)=O