Reaction Details
TargetNuclear receptor subfamily 1 group I member 2
LigandBDBM50204072
Substrate/Competitorn/a
Meas. Tech.ChEMBL_1626059 (CHEMBL3868528)
EC50 1000±n/a nM
Citation Kick, EKBusch, BBMartin, RStevens, WCBollu, VXie, YBoren, BCNyman, MCNanao, MHNguyen, LPlonowski, ASchulman, IGYan, GZhang, HHou, XValente, MNNarayanan, RBehnia, KRodrigues, ADBrock, BSmalley, JCantor, GHLupisella, JSleph, PGrimm, DOstrowski, JWexler, RRKirchgessner, TMohan, R Discovery of Highly Potent Liver X Receptorß Agonists. ACS Med Chem Lett7:1207-1212 (2016) 
 
Nuclear receptor subfamily 1 group I member 2
Name:Nuclear receptor subfamily 1 group I member 2
Type:Nuclear receptor
Mol. Mass.:49774.77
Organism:Homo sapiens (Human)
Description:O75469
Residue:434
BDBM50204072
NameBDBM50204072
Synonyms:CHEMBL3945199 US10945978, Compound 12
TypeSmall organic molecule
Emp. Form.C29H28Cl2F2N2O4S
Mol. Mass.609.511
SMILESCC(C)(O)c1cn(c(n1)C(C)(C)c1c(Cl)cccc1Cl)-c1ccc(cc1F)-c1cc(F)c(CO)c(c1)S(C)(=O)=O