Reaction Details
TargetAcetylcholinesterase
LigandBDBM50204086
Substrate/Competitorn/a
Meas. Tech.ChEMBL_1626142 (CHEMBL3868663)
Ki 0.058500±n/a nM
Citation Tommonaro, GGarcía-Font, NVitale, RMPejin, BIodice, CCañadas, SMarco-Contelles, JOset-Gasque, MJ Avarol derivatives as competitive AChE inhibitors, non hepatotoxic and neuroprotective agents for Alzheimer's disease. Eur J Med Chem122:326-338 (2016) 
 
Acetylcholinesterase
Name:Acetylcholinesterase
Type:Enzyme
Mol. Mass.:71812.79
Organism:Electrophorus electricus (Electric eel)
Description:n/a
Residue:633
BDBM50204086
NameBDBM50204086
Synonyms:Avarol-3''-Thiosalicylate | CHEMBL238756
TypeSmall organic molecule
Emp. Form.C28H34O4S
Mol. Mass.466.632
SMILES[H][C@@]12CCC=C(C)[C@@]1(C)CC[C@H](C)[C@@]2(C)Cc1cc(O)cc(Sc2ccccc2C(O)=O)c1O