Reaction Details
TargetATP-sensitive inward rectifier potassium channel 1
LigandBDBM50204287
Substrate/Competitorn/a
Meas. Tech.ChEMBL_1627126 (CHEMBL3869647)
IC50 18±n/a nM
Citation Zhu, Yde Jesus, RKTang, HWalsh, SPJiang, JGu, XTeumelsan, NShahripour, APio, BDing, FXHa, SPriest, BTSwensen, AMAlonso-Galicia, MFelix, JPBrochu, RMBailey, TThomas-Fowlkes, BZhou, XPai, LYHampton, CHernandez, MOwens, KEhrhart, JRoy, SKaczorowski, GJYang, LParmee, ERSullivan, KGarcia, MLPasternak, A Discovery of a potent and selective ROMK inhibitor with improved pharmacokinetic properties based on an octahydropyrazino[2,1-c][1,4]oxazine scaffold. Bioorg Med Chem Lett26:5695-5702 (2016) 
 
ATP-sensitive inward rectifier potassium channel 1
Name:ATP-sensitive inward rectifier potassium channel 1
Type:Enzyme Catalytic Domain
Mol. Mass.:44809.08
Organism:Homo sapiens (Human)
Description:gi_223460826
Residue:391
BDBM50204287
NameBDBM50204287
Synonyms:CHEMBL3964482
TypeSmall organic molecule
Emp. Form.C22H22FN9O2
Mol. Mass.463.4676
SMILES[H][C@]12CO[C@@H](CN1CCN(C2)C(=O)Cc1cnc(nc1)-n1cnnn1)c1ccc(F)c(C#N)c1C