Reaction Details
TargetEphrin type-A receptor 1
LigandBDBM50204290
Substrate/Competitorn/a
Meas. Tech.ChEMBL_1627207 (CHEMBL3869728)
IC50 31±n/a nM
Citation Lam, BArikawa, YCramlett, JDong, Qde Jong, RFeher, VGrimshaw, CEFarrell, PJHoffman, IDJennings, AJones, BMatuszkiewicz, JMiura, JMiyake, HNatala, SRShi, LTakahashi, MTaylor, EWyrick, CYano, JZalevsky, JNie, Z Discovery of TAK-659 an orally available investigational inhibitor of Spleen Tyrosine Kinase (SYK). Bioorg Med Chem Lett26:5947-5950 (2016) 
 
Ephrin type-A receptor 1
Name:Ephrin type-A receptor 1
Type:Enzyme
Mol. Mass.:108128.04
Organism:Homo sapiens (Human)
Description:P21709
Residue:976
BDBM50204290
NameBDBM50204290
Synonyms:CHEMBL3979920 US20230295171, Example 102
TypeSmall organic molecule
Emp. Form.C17H21FN6O
Mol. Mass.344.3866
SMILESCn1cc(cn1)-c1nc(N[C@@H]2CCCC[C@@H]2N)c(F)c2CNC(=O)c12