Reaction Details
TargetTyrosine-protein kinase SYK
LigandBDBM50204296
Substrate/Competitorn/a
Meas. Tech.ChEMBL_1627193 (CHEMBL3869714)
IC50 0.800000±n/a nM
Citation Lam, BArikawa, YCramlett, JDong, Qde Jong, RFeher, VGrimshaw, CEFarrell, PJHoffman, IDJennings, AJones, BMatuszkiewicz, JMiura, JMiyake, HNatala, SRShi, LTakahashi, MTaylor, EWyrick, CYano, JZalevsky, JNie, Z Discovery of TAK-659 an orally available investigational inhibitor of Spleen Tyrosine Kinase (SYK). Bioorg Med Chem Lett26:5947-5950 (2016) 
 
Tyrosine-protein kinase SYK
Name:Tyrosine-protein kinase SYK
Type:Enzyme
Mol. Mass.:72079.99
Organism:Homo sapiens (Human)
Description:P43405
Residue:635
BDBM50204296
NameBDBM50204296
Synonyms:CHEMBL3941633 | US20230295171, Example 75
TypeSmall organic molecule
Emp. Form.C20H24ClN5O
Mol. Mass.385.89
SMILESCc1cccc(Nc2nc(N[C@@H]3CCCC[C@@H]3N)c(Cl)c3CNC(=O)c23)c1