Reaction Details
TargetMu-type opioid receptor
LigandBDBM50204301
Substrate/Competitorn/a
Meas. Tech.ChEMBL_1627275 (CHEMBL3869796)
Ki>10000±n/a nM
Citation McLeod, MCAubé, JFrankowski, KJ Decahydrobenzoquinolin-5-one sigma receptor ligands: Divergent development of both sigma 1 and sigma 2 receptor selective examples. Bioorg Med Chem Lett26:5689-5694 (2016) 
 
Mu-type opioid receptor
Name:Mu-type opioid receptor
Type:G Protein-Coupled Receptor (GPCR)
Mol. Mass.:44789.51
Organism:Homo sapiens (Human)
Description:P35372
Residue:400
BDBM50204301
NameBDBM50204301
Synonyms:CHEMBL3927338
TypeSmall organic molecule
Emp. Form.C18H26N2OS
Mol. Mass.318.477
SMILES[H][C@]12CCN(Cc3nccs3)[C@]3([H])CCC[C@]([H])([C@@H](CC)C(=O)C1)[C@@]23[H]