Reaction Details
TargetDelta-type opioid receptor
LigandBDBM50204306
Substrate/Competitorn/a
Meas. Tech.ChEMBL_1627274 (CHEMBL3869795)
Ki>10000±n/a nM
Citation McLeod, MCAubé, JFrankowski, KJ Decahydrobenzoquinolin-5-one sigma receptor ligands: Divergent development of both sigma 1 and sigma 2 receptor selective examples. Bioorg Med Chem Lett26:5689-5694 (2016) 
 
Delta-type opioid receptor
Name:Delta-type opioid receptor
Type:G Protein-Coupled Receptor (GPCR)
Mol. Mass.:40382.98
Organism:Homo sapiens (Human)
Description:Competition binding assays were carried out using membrane preparations from transfected HN9.10 cells that constitutively expressed the delta opioid receptor.
Residue:372
BDBM50204306
NameBDBM50204306
Synonyms:CHEMBL3897499
TypeSmall organic molecule
Emp. Form.C25H31F3N2
Mol. Mass.416.5222
SMILES[H][C@@]12CCC[C@@]3([H])N(CCC)CC[C@@]([H])(c4cc5ccc(cc5nc4[C@@H]1CC)C(F)(F)F)[C@]23[H]