Reaction Details
TargetSigma non-opioid intracellular receptor 1
LigandBDBM50204307
Substrate/Competitorn/a
Meas. Tech.ChEMBL_1627277 (CHEMBL3869798)
Ki 5.0±n/a nM
Citation McLeod, MCAubé, JFrankowski, KJ Decahydrobenzoquinolin-5-one sigma receptor ligands: Divergent development of both sigma 1 and sigma 2 receptor selective examples. Bioorg Med Chem Lett26:5689-5694 (2016) 
 
Sigma non-opioid intracellular receptor 1
Name:Sigma non-opioid intracellular receptor 1
Type:Protein
Mol. Mass.:25307.17
Organism:Cavia porcellus (Guinea pig)
Description:Q60492
Residue:223
BDBM50204307
NameBDBM50204307
Synonyms:CHEMBL3926713
TypeSmall organic molecule
Emp. Form.C21H29NO2
Mol. Mass.327.4605
SMILES[H][C@]12CCN(C)[C@]3([H])CCC[C@]([H])([C@@H](Cc4ccc(OC)cc4)C(=O)C1)[C@@]23[H]