Reaction Details
TargetKappa-type opioid receptor
LigandBDBM50204322
Substrate/Competitorn/a
Meas. Tech.ChEMBL_1627276 (CHEMBL3869797)
Ki 1602±n/a nM
Citation McLeod, MCAubé, JFrankowski, KJ Decahydrobenzoquinolin-5-one sigma receptor ligands: Divergent development of both sigma 1 and sigma 2 receptor selective examples. Bioorg Med Chem Lett26:5689-5694 (2016) 
 
Kappa-type opioid receptor
Name:Kappa-type opioid receptor
Type:G Protein-Coupled Receptor (GPCR)
Mol. Mass.:42648.76
Organism:Homo sapiens (Human)
Description:P41145
Residue:380
BDBM50204322
NameBDBM50204322
Synonyms:CHEMBL3889749
TypeSmall organic molecule
Emp. Form.C27H39NO2
Mol. Mass.409.6041
SMILES[H][C@]12CCN(CC3CCCCC3)[C@]3([H])CCC[C@]([H])([C@@H](Cc4ccc(OC)cc4)C(=O)C1)[C@@]23[H]