Reaction Details
Target5-hydroxytryptamine receptor 5A
LigandBDBM50204306
Substrate/Competitorn/a
Meas. Tech.ChEMBL_1627288 (CHEMBL3869809)
Ki>10000±n/a nM
Citation McLeod, MCAubé, JFrankowski, KJ Decahydrobenzoquinolin-5-one sigma receptor ligands: Divergent development of both sigma 1 and sigma 2 receptor selective examples. Bioorg Med Chem Lett26:5689-5694 (2016) 
 
5-hydroxytryptamine receptor 5A
Name:5-hydroxytryptamine receptor 5A
Type:Enzyme
Mol. Mass.:40266.25
Organism:Homo sapiens (Human)
Description:P47898
Residue:357
BDBM50204306
NameBDBM50204306
Synonyms:CHEMBL3897499
TypeSmall organic molecule
Emp. Form.C25H31F3N2
Mol. Mass.416.5222
SMILES[H][C@@]12CCC[C@@]3([H])N(CCC)CC[C@@]([H])(c4cc5ccc(cc5nc4[C@@H]1CC)C(F)(F)F)[C@]23[H]