Reaction Details
TargetAlpha-1D adrenergic receptor
LigandBDBM50204306
Substrate/Competitorn/a
Meas. Tech.ChEMBL_1627293 (CHEMBL3869814)
Ki>10000±n/a nM
Citation McLeod, MCAubé, JFrankowski, KJ Decahydrobenzoquinolin-5-one sigma receptor ligands: Divergent development of both sigma 1 and sigma 2 receptor selective examples. Bioorg Med Chem Lett26:5689-5694 (2016) 
 
Alpha-1D adrenergic receptor
Name:Alpha-1D adrenergic receptor
Type:Enzyme Catalytic Domain
Mol. Mass.:60485.82
Organism:Homo sapiens (Human)
Description:adrenergic Alpha1D ADRA1D HUMAN::P25100
Residue:572
BDBM50204306
NameBDBM50204306
Synonyms:CHEMBL3897499
TypeSmall organic molecule
Emp. Form.C25H31F3N2
Mol. Mass.416.5222
SMILES[H][C@@]12CCC[C@@]3([H])N(CCC)CC[C@@]([H])(c4cc5ccc(cc5nc4[C@@H]1CC)C(F)(F)F)[C@]23[H]