Reaction Details
TargetSigma non-opioid intracellular receptor 1
LigandBDBM50204318
Substrate/Competitorn/a
Meas. Tech.ChEMBL_1627277 (CHEMBL3869798)
Ki 171±n/a nM
Citation McLeod, MCAubé, JFrankowski, KJ Decahydrobenzoquinolin-5-one sigma receptor ligands: Divergent development of both sigma 1 and sigma 2 receptor selective examples. Bioorg Med Chem Lett26:5689-5694 (2016) 
 
Sigma non-opioid intracellular receptor 1
Name:Sigma non-opioid intracellular receptor 1
Type:Protein
Mol. Mass.:25307.17
Organism:Cavia porcellus (Guinea pig)
Description:Q60492
Residue:223
BDBM50204318
NameBDBM50204318
Synonyms:CHEMBL3959852
TypeSmall organic molecule
Emp. Form.C25H34N2O
Mol. Mass.378.5503
SMILES[H][C@@]12CCC[C@@]3([H])N(CCC)CC[C@@]([H])(c4cc5cccc(OC)c5nc4[C@@H]1CC)[C@]23[H]