Reaction Details
TargetProstaglandin G/H synthase 1
LigandBDBM85245
Substrate/Competitorn/a
Meas. Tech.ChEMBL_1627350 (CHEMBL3869871)
IC50 254000±n/a nM
Citation Swiatek, PStrzelecka, MUrniaz, RGebczak, KGebarowski, TGasiorowski, KMalinka, W Synthesis, COX-1/2 inhibition activities and molecular docking study of isothiazolopyridine derivatives. Bioorg Med Chem25:316-326 (2017) 
 
Prostaglandin G/H synthase 1
Name:Prostaglandin G/H synthase 1
Type:Enzyme
Mol. Mass.:68692.62
Organism:Homo sapiens (Human)
Description:P23219
Residue:599
BDBM85245
NameBDBM85245
Synonyms:CAS_36322-90-4 Piroxicam
TypeSmall organic molecule
Emp. Form.C15H13N3O4S
Mol. Mass.331.346
SMILESCN1C(C(=O)Nc2ccccn2)=C(O)c2ccccc2S1(=O)=O