Reaction Details
TargetMetabotropic glutamate receptor 5
LigandBDBM174391
Substrate/Competitorn/a
Meas. Tech.ChEMBL_1627458 (CHEMBL3869979)
EC50 60±n/a nM
Citation Degnan, APMaxwell, DBalakrishnan, ABrown, JMEaston, AGulianello, MHanumegowda, UHill-Drzewi, MMiller, RSantone, KSSenapati, AShields, EESivarao, DVWestphal, RWhiterock, VJZhuo, XBronson, JJMacor, JE Difluorocyclobutylacetylenes as positive allosteric modulators of mGluR5 with reduced bioactivation potential. Bioorg Med Chem Lett26:5871-5876 (2016) 
 
Metabotropic glutamate receptor 5
Name:Metabotropic glutamate receptor 5
Type:Enzyme
Mol. Mass.:132484.72
Organism:Homo sapiens (Human)
Description:n/a
Residue:1212
BDBM174391
NameBDBM174391
Synonyms:US9688669, Example 123
TypeSmall organic molecule
Emp. Form.C20H14ClF3N2O2
Mol. Mass.406.786
SMILESFc1ccc([C@H]2OC(=O)N[C@@H]2c2cncc(c2)C#CC2CC(F)(F)C2)c(Cl)c1