Reaction Details
TargetMetabotropic glutamate receptor 5
LigandBDBM174284
Substrate/Competitorn/a
Meas. Tech.ChEMBL_1627458 (CHEMBL3869979)
EC50>3200±n/a nM
Citation Degnan, APMaxwell, DBalakrishnan, ABrown, JMEaston, AGulianello, MHanumegowda, UHill-Drzewi, MMiller, RSantone, KSSenapati, AShields, EESivarao, DVWestphal, RWhiterock, VJZhuo, XBronson, JJMacor, JE Difluorocyclobutylacetylenes as positive allosteric modulators of mGluR5 with reduced bioactivation potential. Bioorg Med Chem Lett26:5871-5876 (2016) 
 
Metabotropic glutamate receptor 5
Name:Metabotropic glutamate receptor 5
Type:Enzyme
Mol. Mass.:132484.72
Organism:Homo sapiens (Human)
Description:n/a
Residue:1212
BDBM174284
NameBDBM174284
Synonyms:US9688669, Example 117
TypeSmall organic molecule
Emp. Form.C20H14F4N2O2
Mol. Mass.390.331
SMILESFc1cc(F)cc(c1)[C@H]1OC(=O)N[C@@H]1c1cncc(c1)C#CC1CC(F)(F)C1