Reaction Details
TargetMetabotropic glutamate receptor 5
LigandBDBM168300
Substrate/Competitorn/a
Meas. Tech.ChEMBL_1627458 (CHEMBL3869979)
EC50>3200±n/a nM
Citation Degnan, APMaxwell, DBalakrishnan, ABrown, JMEaston, AGulianello, MHanumegowda, UHill-Drzewi, MMiller, RSantone, KSSenapati, AShields, EESivarao, DVWestphal, RWhiterock, VJZhuo, XBronson, JJMacor, JE Difluorocyclobutylacetylenes as positive allosteric modulators of mGluR5 with reduced bioactivation potential. Bioorg Med Chem Lett26:5871-5876 (2016) 
 
Metabotropic glutamate receptor 5
Name:Metabotropic glutamate receptor 5
Type:Enzyme
Mol. Mass.:132484.72
Organism:Homo sapiens (Human)
Description:n/a
Residue:1212
BDBM168300
NameBDBM168300
Synonyms:US9688669, Example 99
Typen/a
Emp. Form.C20H16F2N2O2
Mol. Mass.354.35
SMILESF[C@H]1C[C@@H](C1)C#Cc1cncc(c1)[C@H]1NC(=O)O[C@@H]1c1cccc(F)c1