Reaction Details
TargetMetabotropic glutamate receptor 5
LigandBDBM174331
Substrate/Competitorn/a
Meas. Tech.ChEMBL_1627458 (CHEMBL3869979)
EC50 18±n/a nM
Citation Degnan, APMaxwell, DBalakrishnan, ABrown, JMEaston, AGulianello, MHanumegowda, UHill-Drzewi, MMiller, RSantone, KSSenapati, AShields, EESivarao, DVWestphal, RWhiterock, VJZhuo, XBronson, JJMacor, JE Difluorocyclobutylacetylenes as positive allosteric modulators of mGluR5 with reduced bioactivation potential. Bioorg Med Chem Lett26:5871-5876 (2016) 
 
Metabotropic glutamate receptor 5
Name:Metabotropic glutamate receptor 5
Type:Enzyme
Mol. Mass.:132484.72
Organism:Homo sapiens (Human)
Description:n/a
Residue:1212
BDBM174331
NameBDBM174331
Synonyms:US9688669, Example 121
TypeSmall organic molecule
Emp. Form.C20H15ClF2N2O2
Mol. Mass.388.795
SMILESFC1(F)CC(C1)C#Cc1cncc(c1)[C@H]1NC(=O)O[C@@H]1c1ccc(Cl)cc1