Reaction Details
TargetSterol O-acyltransferase 2
LigandBDBM50204547
Substrate/Competitorn/a
Meas. Tech.ChEBML_1627619
IC50 3000±n/a nM
Citation Kobayashi, KOhshiro, TTomoda, HYin, FCui, HLChouthaiwale, PVTanaka, F Discovery of SOAT2 inhibitors from synthetic small molecules. Bioorg Med Chem Lett26:5899-5901 (2016) 
 
Sterol O-acyltransferase 2
Name:Sterol O-acyltransferase 2
Type:PROTEIN
Mol. Mass.:60426.29
Organism:Chlorocebus aethiops
Description:ChEMBL_116979
Residue:526
BDBM50204547
NameBDBM50204547
Synonyms:CHEMBL3923673
TypeSmall organic molecule
Emp. Form.C22H24N2O3
Mol. Mass.364.4376
SMILESCCC[C@@H]1CC(C[C@@]2(O1)C(=O)Nc1ccccc21)=NOCc1ccccc1