Reaction Details
TargetSterol O-acyltransferase 1
LigandBDBM50204551
Substrate/Competitorn/a
Meas. Tech.ChEBML_1627618
IC50 14000±n/a nM
Citation Kobayashi, KOhshiro, TTomoda, HYin, FCui, HLChouthaiwale, PVTanaka, F Discovery of SOAT2 inhibitors from synthetic small molecules. Bioorg Med Chem Lett26:5899-5901 (2016) 
 
Sterol O-acyltransferase 1
Name:Sterol O-acyltransferase 1
Type:PROTEIN
Mol. Mass.:64744.47
Organism:Chlorocebus aethiops
Description:ChEMBL_116975
Residue:550
BDBM50204551
NameBDBM50204551
Synonyms:CHEMBL3958875
TypeSmall organic molecule
Emp. Form.C22H24N2O3
Mol. Mass.364.4376
SMILESCCC[C@H]1C\C(C[C@]2(O1)C(=O)Nc1ccccc21)=N\OCc1ccccc1