Reaction Details
TargetPhosphodiesterase
LigandBDBM50204598
Substrate/Competitorn/a
Meas. Tech.ChEMBL_1627692 (CHEMBL3870213)
Ki 0.510000±n/a nM
Citation Abdel-Magid, AF Potential Treatment of Cognitive Impairment in Schizophrenia by Phosphodiesterase 2 (PDE2) Inhibitors. ACS Med Chem Lett8:17-18 (2017) 
 
Phosphodiesterase
Name:Phosphodiesterase
Type:Enzyme Catalytic Domain
Mol. Mass.:105547.91
Organism:Macaca mulatta (Rhesus macaque)
Description:n/a
Residue:941
BDBM50204598
NameBDBM50204598
Synonyms:CHEMBL3933723 | US10285989, Example 88
TypeSmall organic molecule
Emp. Form.C17H19F3N4O2S
Mol. Mass.400.419
SMILESCC[C@@H](NC(=O)c1cc(=O)[nH]c(n1)N(C)C)c1ccc(SC(F)(F)F)cc1