Reaction Details
TargetProtein-arginine deiminase type-4
LigandBDBM50204602
Substrate/Competitorn/a
Meas. Tech.ChEMBL_1627702 (CHEMBL3870223)
IC50 40±n/a nM
Citation Abdel-Magid, AF Great Therapeutic Potential of Peptidylarginine Deiminase 4 (PAD4) Inhibitors: Treatment of Rheumatoid Arthritis, Epigenetic Tools, Regulation of Pluripotency in Stem Cells, and More. ACS Med Chem Lett8:19-21 (2017) 
 
Protein-arginine deiminase type-4
Name:Protein-arginine deiminase type-4
Type:Enzyme Catalytic Domain
Mol. Mass.:74078.90
Organism:Homo sapiens (Human)
Description:gi_216548487
Residue:663
BDBM50204602
NameBDBM50204602
Synonyms:CHEMBL3944071
TypeSmall organic molecule
Emp. Form.C27H31N5O2
Mol. Mass.457.5673
SMILESCOc1cc(cc2nc(-c3cc4ccccc4n3CC3CC3)n(C)c12)C(=O)N1CCC[C@@H](N)C1