Reaction Details
TargetProto-oncogene tyrosine-protein kinase ROS
LigandBDBM50204616
Substrate/Competitorn/a
Meas. Tech.ChEBML_1627831
IC50 2.7±n/a nM
Citation Wang, YZhang, GHu, GBu, YLei, HZuo, DHan, MZhai, XGong, P Design, synthesis and biological evaluation of novel 4-arylaminopyrimidine derivatives possessing a hydrazone moiety as dual inhibitors of L1196M ALK and ROS1. Eur J Med Chem123:80-89 (2016) 
 
Proto-oncogene tyrosine-protein kinase ROS
Name:Proto-oncogene tyrosine-protein kinase ROS
Type:Enzyme
Mol. Mass.:263897.39
Organism:Homo sapiens (Human)
Description:P08922
Residue:2347
BDBM50204616
NameBDBM50204616
Synonyms:CHEMBL3922762
TypeSmall organic molecule
Emp. Form.C21H21ClFN5O2S
Mol. Mass.461.94
SMILESCC(C)S(=O)(=O)c1ccccc1Nc1nc(N\N=C(/C)c2ccc(F)cc2)ncc1Cl