Reaction Details
TargetHepatocyte growth factor receptor
LigandBDBM50204615
Substrate/Competitorn/a
Meas. Tech.ChEBML_1627832
IC50 220±n/a nM
Citation Wang, YZhang, GHu, GBu, YLei, HZuo, DHan, MZhai, XGong, P Design, synthesis and biological evaluation of novel 4-arylaminopyrimidine derivatives possessing a hydrazone moiety as dual inhibitors of L1196M ALK and ROS1. Eur J Med Chem123:80-89 (2016) 
 
Hepatocyte growth factor receptor
Name:Hepatocyte growth factor receptor
Type:Protein
Mol. Mass.:155559.73
Organism:Homo sapiens (Human)
Description:P08581
Residue:1390
BDBM50204615
NameBDBM50204615
Synonyms:CHEMBL3921664
TypeSmall organic molecule
Emp. Form.C20H19ClFN5O2S
Mol. Mass.447.914
SMILESCC(C)S(=O)(=O)c1ccccc1Nc1nc(N\N=C\c2ccc(F)cc2)ncc1Cl