Reaction Details
TargetALK tyrosine kinase receptor
LigandBDBM50204618
Substrate/Competitorn/a
Meas. Tech.ChEBML_1627829
IC50 5.5±n/a nM
Citation Wang, YZhang, GHu, GBu, YLei, HZuo, DHan, MZhai, XGong, P Design, synthesis and biological evaluation of novel 4-arylaminopyrimidine derivatives possessing a hydrazone moiety as dual inhibitors of L1196M ALK and ROS1. Eur J Med Chem123:80-89 (2016) 
 
ALK tyrosine kinase receptor
Name:ALK tyrosine kinase receptor
Type:Protein
Mol. Mass.:176453.10
Organism:Homo sapiens (Human)
Description:Q9UM73
Residue:1620
BDBM50204618
NameBDBM50204618
Synonyms:CHEMBL3934594
TypeSmall organic molecule
Emp. Form.C21H19ClF3N5O2S
Mol. Mass.497.921
SMILESCC(C)S(=O)(=O)c1ccccc1Nc1nc(N\N=C\c2cccc(c2)C(F)(F)F)ncc1Cl