Reaction Details
TargetProto-oncogene tyrosine-protein kinase ROS
LigandBDBM50204620
Substrate/Competitorn/a
Meas. Tech.ChEMBL_1627831 (CHEMBL3870416)
IC50 4.7±n/a nM
Citation Wang, YZhang, GHu, GBu, YLei, HZuo, DHan, MZhai, XGong, P Design, synthesis and biological evaluation of novel 4-arylaminopyrimidine derivatives possessing a hydrazone moiety as dual inhibitors of L1196M ALK and ROS1. Eur J Med Chem123:80-89 (2016) 
 
Proto-oncogene tyrosine-protein kinase ROS
Name:Proto-oncogene tyrosine-protein kinase ROS
Type:Enzyme
Mol. Mass.:263897.39
Organism:Homo sapiens (Human)
Description:P08922
Residue:2347
BDBM50204620
NameBDBM50204620
Synonyms:CHEMBL3950479
TypeSmall organic molecule
Emp. Form.C22H24ClN5O3S
Mol. Mass.473.976
SMILESCOc1ccc(cc1)C(\C)=N\Nc1ncc(Cl)c(Nc2ccccc2S(=O)(=O)C(C)C)n1