Reaction Details
TargetDual specificity protein kinase CLK1
LigandBDBM50204646
Substrate/Competitorn/a
Meas. Tech.ChEBML_1627842
IC50 890±n/a nM
Citation Lawson, MRodrigo, JBaratte, BRobert, TDelehouzé, CLozach, ORuchaud, SBach, SBrion, JDAlami, MHamze, A Synthesis, biological evaluation and molecular modeling studies of imidazo[1,2-a]pyridines derivatives as protein kinase inhibitors. Eur J Med Chem123:105-114 (2016) 
 
Dual specificity protein kinase CLK1
Name:Dual specificity protein kinase CLK1
Type:Protein
Mol. Mass.:57322.21
Organism:Homo sapiens (Human)
Description:P49759
Residue:484
BDBM50204646
NameBDBM50204646
Synonyms:CHEMBL3962894
TypeSmall organic molecule
Emp. Form.C14H11N3O3
Mol. Mass.269.2554
SMILESNC(=O)c1cc(ccc1O)-c1cn2cc(O)ccc2n1