Reaction Details
TargetDual specificity tyrosine-phosphorylation-regulated kinase 1A
LigandBDBM50204647
Substrate/Competitorn/a
Meas. Tech.ChEBML_1627841
IC50 8900±n/a nM
Citation Lawson, MRodrigo, JBaratte, BRobert, TDelehouzé, CLozach, ORuchaud, SBach, SBrion, JDAlami, MHamze, A Synthesis, biological evaluation and molecular modeling studies of imidazo[1,2-a]pyridines derivatives as protein kinase inhibitors. Eur J Med Chem123:105-114 (2016) 
 
Dual specificity tyrosine-phosphorylation-regulated kinase 1A
Name:Dual specificity tyrosine-phosphorylation-regulated kinase 1A
Type:Enzyme
Mol. Mass.:85616.61
Organism:Homo sapiens (Human)
Description:Q13627
Residue:763
BDBM50204647
NameBDBM50204647
Synonyms:CHEMBL3917542
TypeSmall organic molecule
Emp. Form.C14H10ClN3O2
Mol. Mass.287.701
SMILESNC(=O)c1cc(ccc1O)-c1cn2cc(Cl)ccc2n1