Reaction Details
TargetDual specificity tyrosine-phosphorylation-regulated kinase 1A
LigandBDBM50204653
Substrate/Competitorn/a
Meas. Tech.ChEMBL_1627841 (CHEMBL3870426)
IC50 4700±n/a nM
Citation Lawson, MRodrigo, JBaratte, BRobert, TDelehouzé, CLozach, ORuchaud, SBach, SBrion, JDAlami, MHamze, A Synthesis, biological evaluation and molecular modeling studies of imidazo[1,2-a]pyridines derivatives as protein kinase inhibitors. Eur J Med Chem123:105-114 (2016) 
 
Dual specificity tyrosine-phosphorylation-regulated kinase 1A
Name:Dual specificity tyrosine-phosphorylation-regulated kinase 1A
Type:Enzyme
Mol. Mass.:85616.61
Organism:Homo sapiens (Human)
Description:Q13627
Residue:763
BDBM50204653
NameBDBM50204653
Synonyms:CHEMBL3945429
TypeSmall organic molecule
Emp. Form.C14H10FN3O2
Mol. Mass.271.2465
SMILESNC(=O)c1cc(ccc1O)-c1cn2cc(F)ccc2n1