Reaction Details
Target5-hydroxytryptamine receptor 7
LigandBDBM10755
Substrate/Competitorn/a
Meas. Tech.ChEMBL_1627885 (CHEMBL3870470)
EC50 5.8±n/a nM
Citation Kim, YPark, HLee, JTae, JKim, HJMin, SJRhim, HChoo, H 5-HT7 receptor modulators: Amino groups attached to biphenyl scaffold determine functional activity. Eur J Med Chem123:180-190 (2016) 
 
5-hydroxytryptamine receptor 7
Name:5-hydroxytryptamine receptor 7
Type:G Protein-Coupled Receptor (GPCR)
Mol. Mass.:53573.08
Organism:Homo sapiens (Human)
Description:P34969
Residue:479
BDBM10755
NameBDBM10755
Synonyms:14C-5-hydroxy tryptamine creatinine disulfate 5-HT 5-hydroxy tryptamine creatinine disulfate Serotonin | [3H]-5-HT
TypeSmall organic molecule
Emp. Form.C10H12N2O
Mol. Mass.176.2151
SMILESNCCc1c[nH]c2ccc(O)cc12