Reaction Details
Target5-hydroxytryptamine receptor 7
LigandBDBM50204674
Substrate/Competitorn/a
Meas. Tech.ChEMBL_1627882 (CHEMBL3870467)
Ki 18±n/a nM
Citation Kim, YPark, HLee, JTae, JKim, HJMin, SJRhim, HChoo, H 5-HT7 receptor modulators: Amino groups attached to biphenyl scaffold determine functional activity. Eur J Med Chem123:180-190 (2016) 
 
5-hydroxytryptamine receptor 7
Name:5-hydroxytryptamine receptor 7
Type:G Protein-Coupled Receptor (GPCR)
Mol. Mass.:53573.08
Organism:Homo sapiens (Human)
Description:P34969
Residue:479
BDBM50204674
NameBDBM50204674
Synonyms:CHEMBL3892079
TypeSmall organic molecule
Emp. Form.C26H30N2O2
Mol. Mass.402.5286
SMILESCOc1ccccc1N1CCN(Cc2ccc(C)c(c2)-c2ccccc2OC)CC1