Reaction Details
Target5-hydroxytryptamine receptor 7
LigandBDBM50098551
Substrate/Competitorn/a
Meas. Tech.ChEMBL_1627882 (CHEMBL3870467)
Ki 0.340000±n/a nM
Citation Kim, YPark, HLee, JTae, JKim, HJMin, SJRhim, HChoo, H 5-HT7 receptor modulators: Amino groups attached to biphenyl scaffold determine functional activity. Eur J Med Chem123:180-190 (2016) 
 
5-hydroxytryptamine receptor 7
Name:5-hydroxytryptamine receptor 7
Type:G Protein-Coupled Receptor (GPCR)
Mol. Mass.:53573.08
Organism:Homo sapiens (Human)
Description:P34969
Residue:479
BDBM50098551
NameBDBM50098551
Synonyms:(R)-3-(2-(2-(4-methylpiperidin-1-yl)ethyl)pyrrolidin-1-ylsulfonyl)phenol 3-{(R)-2-[2-(4-Methyl-piperidin-1-yl)-ethyl]-pyrrolidine-1-sulfonyl}-phenol 3-{2-[2-(4-Methyl-piperidin-1-yl)-ethyl]-pyrrolidine-1-sulfonyl}-phenol CHEMBL282199 | SB-269970
TypeSmall organic molecule
Emp. Form.C18H28N2O3S
Mol. Mass.352.492
SMILESCC1CCN(CC[C@H]2CCCN2S(=O)(=O)c2cccc(O)c2)CC1