Reaction Details
TargetMast/stem cell growth factor receptor Kit
LigandBDBM50399540
Substrate/Competitorn/a
Meas. Tech.ChEMBL_1628021 (CHEMBL3870606)
IC50 6.7±n/a nM
Citation Liu, JNie, MWang, YHu, JZhang, FGao, YLiu, YGong, P Design, synthesis and structure-activity relationships of novel 4-phenoxyquinoline derivatives containing 1,2,4-triazolone moiety as c-Met kinase inhibitors. Eur J Med Chem123:431-446 (2016) 
 
Mast/stem cell growth factor receptor Kit
Name:Mast/stem cell growth factor receptor Kit
Type:Protein
Mol. Mass.:109869.37
Organism:Homo sapiens (Human)
Description:P10721
Residue:976
BDBM50399540
NameBDBM50399540
Synonyms:FORETINIB US10882853, Compound For-Oxide
TypeSmall organic molecule
Emp. Form.C34H34F2N4O6
Mol. Mass.632.6538
SMILESCOc1cc2c(Oc3ccc(NC(=O)C4(CC4)C(=O)Nc4ccc(F)cc4)cc3F)ccnc2cc1OCCCN1CCOCC1