Reaction Details
TargetHepatocyte growth factor receptor
LigandBDBM50205148
Substrate/Competitorn/a
Meas. Tech.ChEMBL_1628029 (CHEMBL3870614)
IC50 4.6±n/a nM
Citation Liu, JNie, MWang, YHu, JZhang, FGao, YLiu, YGong, P Design, synthesis and structure-activity relationships of novel 4-phenoxyquinoline derivatives containing 1,2,4-triazolone moiety as c-Met kinase inhibitors. Eur J Med Chem123:431-446 (2016) 
 
Hepatocyte growth factor receptor
Name:Hepatocyte growth factor receptor
Type:Protein
Mol. Mass.:155559.73
Organism:Homo sapiens (Human)
Description:P08581
Residue:1390
BDBM50205148
NameBDBM50205148
Synonyms:CHEMBL3938747
TypeSmall organic molecule
Emp. Form.C36H37ClFN7O5
Mol. Mass.702.174
SMILESCOc1cc2c(Oc3ccc(NC(=O)c4nn(-c5ccccc5Cl)c(=O)n4C4CC4)cc3F)ccnc2cc1OCCCN1CCN(C)CC1