Reaction Details
TargetCysteine protease ATG4B
LigandBDBM33413
Substrate/Competitorn/a
Meas. Tech.ChEMBL_1628065 (CHEMBL3870650)
IC50 2300±n/a nM
Citation Cleenewerck, MGrootaert, MOJGladysz, RAdriaenssens, YRoelandt, RJoossens, JLambeir, AMDe Meyer, GRYDeclercq, WAugustyns, KMartinet, WVan der Veken, P Inhibitor screening and enzymatic activity determination for autophagy target Atg4B using a gel electrophoresis-based assay. Eur J Med Chem123:631-638 (2016) 
 
Cysteine protease ATG4B
Name:Cysteine protease ATG4B
Type:Enzyme Catalytic Domain
Mol. Mass.:44279.79
Organism:Homo sapiens (Human)
Description:gi_47132611
Residue:393
BDBM33413
NameBDBM33413
Synonyms:benzo[7]annulene-8-carboxylic acid, 5
TypeSmall organic molecule
Emp. Form.C12H8O6
Mol. Mass.248.1883
SMILESOC(=O)c1cc(O)c(=O)c2c(O)c(O)ccc2c1