Reaction Details
TargetReceptor tyrosine-protein kinase erbB-2
LigandBDBM50307768
Substrate/Competitorn/a
Meas. Tech.ChEMBL_1628136 (CHEMBL3870721)
IC50 16±n/a nM
Citation Ding, CChen, SZhang, CHu, GZhang, WLi, LChen, YZTan, CJiang, Y Synthesis and investigation of novel 6-(1,2,3-triazol-4-yl)-4-aminoquinazolin derivatives possessing hydroxamic acid moiety for cancer therapy. Bioorg Med Chem25:27-37 (2017) 
 
Receptor tyrosine-protein kinase erbB-2
Name:Receptor tyrosine-protein kinase erbB-2
Type:n/a
Mol. Mass.:137894.47
Organism:Homo sapiens (Human)
Description:P04626
Residue:1255
BDBM50307768
NameBDBM50307768
Synonyms:7-(4-(3-Ethynylphenylamino)-7-methoxyquinazolin-6-yloxy)-N-hydroxyheptanamide CUDC-101
TypeSmall organic molecule
Emp. Form.C24H26N4O4
Mol. Mass.434.4876
SMILESCOc1cc2ncnc(Nc3cccc(c3)C#C)c2cc1OCCCCCCC(=O)NO