Reaction Details
TargetEpidermal growth factor receptor
LigandBDBM50205264
Substrate/Competitorn/a
Meas. Tech.ChEMBL_1628119 (CHEMBL3870704)
IC50 0.120000±n/a nM
Citation Ding, CChen, SZhang, CHu, GZhang, WLi, LChen, YZTan, CJiang, Y Synthesis and investigation of novel 6-(1,2,3-triazol-4-yl)-4-aminoquinazolin derivatives possessing hydroxamic acid moiety for cancer therapy. Bioorg Med Chem25:27-37 (2017) 
 
Epidermal growth factor receptor
Name:Epidermal growth factor receptor
Type:Receptor Kinase Domain
Mol. Mass.:134279.59
Organism:Homo sapiens (Human)
Description:P00533
Residue:1210
BDBM50205264
NameBDBM50205264
Synonyms:CHEMBL3930620
TypeSmall organic molecule
Emp. Form.C23H23ClFN7O2
Mol. Mass.483.926
SMILESONC(=O)CCCCCCn1cc(nn1)-c1ccc2ncnc(Nc3cccc(Cl)c3F)c2c1