Reaction Details
TargetNuclear factor erythroid 2-related factor 2
LigandBDBM50006931
Substrate/Competitorn/a
Meas. Tech.ChEMBL_1628344 (CHEMBL3870929)
IC50 1800±n/a nM
Citation Yasuda, DNakajima, MYuasa, AObata, RTakahashi, KOhe, TIchimura, YKomatsu, MYamamoto, MImamura, RKojima, HOkabe, TNagano, TMashino, T Synthesis of Keap1-phosphorylated p62 and Keap1-Nrf2 protein-protein interaction inhibitors and their inhibitory activity. Bioorg Med Chem Lett26:5956-5959 (2016) 
 
Nuclear factor erythroid 2-related factor 2
Name:Nuclear factor erythroid 2-related factor 2
Type:PROTEIN
Mol. Mass.:67786.89
Organism:Homo sapiens (Human)
Description:ChEMBL_107924
Residue:605
BDBM50006931
NameBDBM50006931
Synonyms:CHEMBL2402207
TypeSmall organic molecule
Emp. Form.C24H22N2O6S2
Mol. Mass.498.571
SMILESCOc1ccc(cc1)S(=O)(=O)Nc1ccc(NS(=O)(=O)c2ccc(OC)cc2)c2ccccc12