Reaction Details
TargetNuclear factor erythroid 2-related factor 2
LigandBDBM50205337
Substrate/Competitorn/a
Meas. Tech.ChEMBL_1628344 (CHEMBL3870929)
IC50 320±n/a nM
Citation Yasuda, DNakajima, MYuasa, AObata, RTakahashi, KOhe, TIchimura, YKomatsu, MYamamoto, MImamura, RKojima, HOkabe, TNagano, TMashino, T Synthesis of Keap1-phosphorylated p62 and Keap1-Nrf2 protein-protein interaction inhibitors and their inhibitory activity. Bioorg Med Chem Lett26:5956-5959 (2016) 
 
Nuclear factor erythroid 2-related factor 2
Name:Nuclear factor erythroid 2-related factor 2
Type:PROTEIN
Mol. Mass.:67786.89
Organism:Homo sapiens (Human)
Description:ChEMBL_107924
Residue:605
BDBM50205337
NameBDBM50205337
Synonyms:CHEMBL3906697
TypeSmall organic molecule
Emp. Form.C28H28N2O8S2
Mol. Mass.584.661
SMILESCCOc1ccc(cc1)S(=O)(=O)Nc1cc(CC(O)=O)c(NS(=O)(=O)c2ccc(OCC)cc2)c2ccccc12