Reaction Details
TargetAlpha-1A adrenergic receptor
LigandBDBM50205362
Substrate/Competitorn/a
Meas. Tech.ChEMBL_1628379 (CHEMBL3870964)
Ki<1995±n/a nM
Citation Procopiou, PAAncliff, RAGore, PMHancock, APHodgson, STHolmes, DSKeeling, SPLooker, BEParr, NARowedder, JESlack, RJ The discovery of quinoline based single-ligand human H Bioorg Med Chem Lett26:5855-5859 (2016) 
 
Alpha-1A adrenergic receptor
Name:Alpha-1A adrenergic receptor
Type:Cell-surface receptors
Mol. Mass.:51511.67
Organism:Homo sapiens (Human)
Description:P35348
Residue:466
BDBM50205362
NameBDBM50205362
Synonyms:CHEMBL3896541
TypeSmall organic molecule
Emp. Form.C31H40N4O3
Mol. Mass.516.6743
SMILESOC(=O)c1ccnc2c(cccc12)N1CCN(CCc2ccc(OCCCN3CCCCCC3)cc2)CC1