Reaction Details
TargetAlpha-1A adrenergic receptor
LigandBDBM50205364
Substrate/Competitorn/a
Meas. Tech.ChEMBL_1628379 (CHEMBL3870964)
Ki<1995±n/a nM
Citation Procopiou, PAAncliff, RAGore, PMHancock, APHodgson, STHolmes, DSKeeling, SPLooker, BEParr, NARowedder, JESlack, RJ The discovery of quinoline based single-ligand human H Bioorg Med Chem Lett26:5855-5859 (2016) 
 
Alpha-1A adrenergic receptor
Name:Alpha-1A adrenergic receptor
Type:Cell-surface receptors
Mol. Mass.:51511.67
Organism:Homo sapiens (Human)
Description:P35348
Residue:466
BDBM50205364
NameBDBM50205364
Synonyms:CHEMBL3935303
TypeSmall organic molecule
Emp. Form.C33H44N4O3
Mol. Mass.544.7275
SMILESOC(=O)CCc1ccc2cccc(N3CCN(CCc4ccc(OCCCN5CCCCCC5)cc4)CC3)c2n1