Reaction Details
TargetAlpha-1B adrenergic receptor
LigandBDBM50205360
Substrate/Competitorn/a
Meas. Tech.ChEMBL_1628380 (CHEMBL3870965)
Ki 100±n/a nM
Citation Procopiou, PAAncliff, RAGore, PMHancock, APHodgson, STHolmes, DSKeeling, SPLooker, BEParr, NARowedder, JESlack, RJ The discovery of quinoline based single-ligand human H Bioorg Med Chem Lett26:5855-5859 (2016) 
 
Alpha-1B adrenergic receptor
Name:Alpha-1B adrenergic receptor
Type:Enzyme
Mol. Mass.:56862.13
Organism:Homo sapiens (Human)
Description:P35368
Residue:520
BDBM50205360
NameBDBM50205360
Synonyms:CHEMBL3921827
TypeSmall organic molecule
Emp. Form.C31H42N4O
Mol. Mass.486.6914
SMILESC(COc1ccc(CCCN2CCN(CC2)c2cccc3cccnc23)cc1)CN1CCCCCC1