Reaction Details
TargetAlpha-1B adrenergic receptor
LigandBDBM50205361
Substrate/Competitorn/a
Meas. Tech.ChEMBL_1628380 (CHEMBL3870965)
Ki 50±n/a nM
Citation Procopiou, PAAncliff, RAGore, PMHancock, APHodgson, STHolmes, DSKeeling, SPLooker, BEParr, NARowedder, JESlack, RJ The discovery of quinoline based single-ligand human H Bioorg Med Chem Lett26:5855-5859 (2016) 
 
Alpha-1B adrenergic receptor
Name:Alpha-1B adrenergic receptor
Type:Enzyme
Mol. Mass.:56862.13
Organism:Homo sapiens (Human)
Description:P35368
Residue:520
BDBM50205361
NameBDBM50205361
Synonyms:CHEMBL3893197
TypeSmall organic molecule
Emp. Form.C32H44N4O
Mol. Mass.500.718
SMILESC(CCc1ccc(OCCCN2CCCCCC2)cc1)CN1CCN(CC1)c1cccc2cccnc12