Reaction Details
TargetAlpha-1B adrenergic receptor
LigandBDBM50205359
Substrate/Competitorn/a
Meas. Tech.ChEMBL_1628380 (CHEMBL3870965)
Ki 251±n/a nM
Citation Procopiou, PAAncliff, RAGore, PMHancock, APHodgson, STHolmes, DSKeeling, SPLooker, BEParr, NARowedder, JESlack, RJ The discovery of quinoline based single-ligand human H Bioorg Med Chem Lett26:5855-5859 (2016) 
 
Alpha-1B adrenergic receptor
Name:Alpha-1B adrenergic receptor
Type:Enzyme
Mol. Mass.:56862.13
Organism:Homo sapiens (Human)
Description:P35368
Residue:520
BDBM50205359
NameBDBM50205359
Synonyms:CHEMBL3917428
TypeSmall organic molecule
Emp. Form.C40H50N4O3
Mol. Mass.634.85
SMILESOC(=O)CCc1ccc2cc(Cc3ccccc3)cc(N3CCN(CCc4ccc(OCCCN5CCCCCC5)cc4)CC3)c2n1