Reaction Details
TargetHistamine H3 receptor
LigandBDBM50205353
Substrate/Competitorn/a
Meas. Tech.ChEMBL_1628378 (CHEMBL3870963)
Ki 0.501187±n/a nM
Citation Procopiou, PAAncliff, RAGore, PMHancock, APHodgson, STHolmes, DSKeeling, SPLooker, BEParr, NARowedder, JESlack, RJ The discovery of quinoline based single-ligand human H Bioorg Med Chem Lett26:5855-5859 (2016) 
 
Histamine H3 receptor
Name:Histamine H3 receptor
Type:G Protein-Coupled Receptor (GPCR)
Mol. Mass.:48691.47
Organism:Homo sapiens (Human)
Description:Binding assays were using CHO cells stably expressing hH3R receptors.
Residue:445
BDBM50205353
NameBDBM50205353
Synonyms:CHEMBL3947980
TypeSmall organic molecule
Emp. Form.C30H40N4O
Mol. Mass.472.6648
SMILESC(COc1ccc(CCN2CCN(CC2)c2cccc3cccnc23)cc1)CN1CCCCCC1