Reaction Details
TargetHistamine H1 receptor
LigandBDBM50205369
Substrate/Competitorn/a
Meas. Tech.ChEMBL_1628377 (CHEMBL3870962)
Ki 40±n/a nM
Citation Procopiou, PAAncliff, RAGore, PMHancock, APHodgson, STHolmes, DSKeeling, SPLooker, BEParr, NARowedder, JESlack, RJ The discovery of quinoline based single-ligand human H Bioorg Med Chem Lett26:5855-5859 (2016) 
 
Histamine H1 receptor
Name:Histamine H1 receptor
Type:G Protein-Coupled Receptor (GPCR)
Mol. Mass.:55808.72
Organism:Homo sapiens (Human)
Description:Cell pellets from SK-N-MC cells transfected with human H1 receptor were used in binding assay.
Residue:487
BDBM50205369
NameBDBM50205369
Synonyms:CHEMBL3907368
TypeSmall organic molecule
Emp. Form.C33H44N4O3
Mol. Mass.544.7275
SMILESOC(=O)CCc1cnc2c(cccc2c1)N1CCN(CCc2ccc(OCCCN3CCCCCC3)cc2)CC1