Reaction Details
TargetAlpha-1A adrenergic receptor
LigandBDBM50205358
Substrate/Competitorn/a
Meas. Tech.ChEMBL_1628379 (CHEMBL3870964)
Ki 316±n/a nM
Citation Procopiou, PAAncliff, RAGore, PMHancock, APHodgson, STHolmes, DSKeeling, SPLooker, BEParr, NARowedder, JESlack, RJ The discovery of quinoline based single-ligand human H Bioorg Med Chem Lett26:5855-5859 (2016) 
 
Alpha-1A adrenergic receptor
Name:Alpha-1A adrenergic receptor
Type:Cell-surface receptors
Mol. Mass.:51511.67
Organism:Homo sapiens (Human)
Description:P35348
Residue:466
BDBM50205358
NameBDBM50205358
Synonyms:CHEMBL3898341
TypeSmall organic molecule
Emp. Form.C37H52N4O3
Mol. Mass.600.8338
SMILESCCCCc1cc(N2CCN(CCc3ccc(OCCCN4CCCCCC4)cc3)CC2)c2nc(CCC(O)=O)ccc2c1