Reaction Details
TargetHistamine H1 receptor
LigandBDBM50205353
Substrate/Competitorn/a
Meas. Tech.ChEMBL_1628377 (CHEMBL3870962)
Ki 20±n/a nM
Citation Procopiou, PAAncliff, RAGore, PMHancock, APHodgson, STHolmes, DSKeeling, SPLooker, BEParr, NARowedder, JESlack, RJ The discovery of quinoline based single-ligand human H Bioorg Med Chem Lett26:5855-5859 (2016) 
 
Histamine H1 receptor
Name:Histamine H1 receptor
Type:G Protein-Coupled Receptor (GPCR)
Mol. Mass.:55808.72
Organism:Homo sapiens (Human)
Description:Cell pellets from SK-N-MC cells transfected with human H1 receptor were used in binding assay.
Residue:487
BDBM50205353
NameBDBM50205353
Synonyms:CHEMBL3947980
TypeSmall organic molecule
Emp. Form.C30H40N4O
Mol. Mass.472.6648
SMILESC(COc1ccc(CCN2CCN(CC2)c2cccc3cccnc23)cc1)CN1CCCCCC1