Reaction Details
TargetCarbonic anhydrase 1
LigandBDBM50205567
Substrate/Competitorn/a
Meas. Tech.ChEMBL_1628394 (CHEMBL3870979)
Ki>10000±n/a nM
Citation Esirden, ITanç, MSupuran, CTKaya, M Microwave assisted synthesis of novel tetrazole/sulfonamide derivatives based on octahydroacridine, xanthene and chromene skeletons as inhibitors of the carbonic anhydrases isoforms I, II, IV and VII. Bioorg Med Chem Lett27:86-89 (2017) 
 
Carbonic anhydrase 1
Name:Carbonic anhydrase 1
Type:Enzyme
Mol. Mass.:28873.37
Organism:Homo sapiens (Human)
Description:P00915
Residue:261
BDBM50205567
NameBDBM50205567
Synonyms:CHEMBL3910545
TypeSmall organic molecule
Emp. Form.C8H6N4O
Mol. Mass.174.1594
SMILESO=Cc1ccc(cc1)-c1nnn[nH]1